{"text_format":"1","workbook":"xlsx","n_sheets":8,"sheets":["A. Overview","B. Engagements","C. Invoice Details","D. Breakdown Details","Reference","Agency Structure","Sheet1","Named Ranges"],"not_rendered":{"charts":0,"images":3,"macros":1,"external_links":0,"defined_names":29,"comments":0,"pivot_tables":0},"unopened":[],"bounds":{"document_bytes":16777216,"sheet_cells":100000,"rows_first":2000,"rows_last":500,"rows_between":2000,"halvings":0,"cell_chars":16384,"cell_head_chars":4096},"cells_cut":0,"cells_raw":0,"read":"whole","date_system":"1900"}

{"sheet":"A. Overview","index":0,"n_rows":74,"n_cols":7,"rows_kept":74,"cut":false,"hidden":false,"merged":[[22,1,22,6],[9,3,9,6],[0,1,0,7],[3,2,3,6],[6,2,6,6],[7,3,7,6],[8,3,8,6],[10,3,10,6],[14,2,14,6],[16,2,16,4],[16,5,16,6],[11,3,11,6],[17,2,17,4],[17,5,17,6],[15,2,15,4],[15,5,15,6],[23,1,23,6],[30,1,30,2],[31,1,31,2],[34,2,54,2],[34,1,54,1],[25,1,27,1],[25,6,27,6],[27,3,27,5],[26,3,26,5],[25,3,25,5],[35,4,35,6],[47,4,47,6],[55,2,58,2],[55,1,58,1],[66,4,66,6],[67,4,67,6],[69,4,69,6],[58,4,58,6],[59,4,59,6],[64,4,64,6],[65,4,65,6],[56,4,56,6],[60,4,60,6],[61,4,61,6],[62,4,62,6],[68,4,68,6],[70,4,70,6],[59,2,73,2],[59,1,73,1],[63,4,63,6],[36,4,36,6],[37,4,37,6],[38,4,38,6],[39,4,39,6],[40,4,40,6],[41,4,41,6],[42,4,42,6],[43,4,43,6],[44,4,44,6],[45,4,45,6],[46,4,46,6],[57,4,57,6],[71,4,71,6],[72,4,72,6],[73,4,73,6],[30,4,30,6],[31,4,31,6],[32,4,32,6],[33,4,33,6],[34,4,34,6],[48,4,48,6],[49,4,49,6],[50,4,50,6],[51,4,51,6],[52,4,52,6],[53,4,53,6],[54,4,54,6],[55,4,55,6]]}
[null,"BAS & ICT Consulting Probity Data Request - Overview"]
[]
[]
[null,null,"Please follow the instructions below to fill in this form"]
[]
[]
[null,null,"Contact Details"]
[null,null,"Company Name"]
[null,null,"Contact Name"]
[null,null,"Contract Phone Number"]
[null,null,"Email Address"]
[null,null,"Reporting Period"]
[]
[]
[null,null,"Overall Summary"]
{"$rows_left_out":60}
{"sheet":"B. Engagements","index":1,"n_rows":473,"n_cols":20,"rows_kept":473,"cut":false,"hidden":false,"merged":[[0,0,0,19]]}
["BAS Probity Data Request - Engagements"]
["Mandatory\nInfo: Report Only New Engagements or changes to existing engagements.","Mandatory","Non-Mandatory","Non-Mandatory","Non-Mandatory","Mandatory\nuse DropDown","Mandatory\nUse DropDown","Mandatory\nUse DropDown","Mandatory\nUse DropDown","Mandatory\nUse DropDown","Mandatory","Non-Mandatory","Mandatory\nPre-Selected, Change if required","Mandatory","Mandatory\nUse DropDown","Mandatory\nUse DropDown","Mandatory","Mandatory","Mandatory\nUse DropDown","Non-Mandatory\nUse to provide any additional info/ clarifications"]
["New Engagement (or) Update to Engagement details ?","Supplier Project Code","Engagement ID or SOW Number","Engagement Name\n(As per Engagement Letter)","Engagement Description\n(high level)","The engagement was won through competitive bidding?","Assignment / \nSecondment","Pricing Model","Consulting Engagement Type \n(Category)","Consulting Service Type\n(Sub-category)","Engagement Start Date\n(as per SOW or Engagement Letter)","Engagement End Date\n(as per SOW or Engagement Letter)","Under FrameWork","NSW Engagement Leader and Email","Cluster","Agency","Total Estimated Engagement Cost (As per SoW or Eng. Letter, $, excl. GST ) ","Suppliers' ABN","Status","Comments"]
[]
[null,null,null,null,null,null,null,null,null,null,null,null,{"$f":"IF(K5=\"\",\"\",_xlfn.XLOOKUP(K5,'Named Ranges'!$BC$4:$BC$6,'Named Ranges'!$BA$4:$BA$6,\"No\",-1,1))","v":""}]
[null,null,null,null,null,null,null,null,null,null,null,null,{"$f":"IF(K6=\"\",\"\",_xlfn.XLOOKUP(K6,'Named Ranges'!$BC$4:$BC$6,'Named Ranges'!$BA$4:$BA$6,\"No\",-1,1))","v":""}]
[null,null,null,null,null,null,null,null,null,null,null,null,{"$f":"IF(K7=\"\",\"\",_xlfn.XLOOKUP(K7,'Named Ranges'!$BC$4:$BC$6,'Named Ranges'!$BA$4:$BA$6,\"No\",-1,1))","v":""}]
[null,null,null,null,null,null,null,null,null,null,null,null,{"$f":"IF(K8=\"\",\"\",_xlfn.XLOOKUP(K8,'Named Ranges'!$BC$4:$BC$6,'Named Ranges'!$BA$4:$BA$6,\"No\",-1,1))","v":""}]
[null,null,null,null,null,null,null,null,null,null,null,null,{"$f":"IF(K9=\"\",\"\",_xlfn.XLOOKUP(K9,'Named Ranges'!$BC$4:$BC$6,'Named Ranges'!$BA$4:$BA$6,\"No\",-1,1))","v":""}]
[null,null,null,null,null,null,null,null,null,null,null,null,{"$f":"IF(K10=\"\",\"\",_xlfn.XLOOKUP(K10,'Named Ranges'!$BC$4:$BC$6,'Named Ranges'!$BA$4:$BA$6,\"No\",-1,1))","v":""}]
[null,null,null,null,null,null,null,null,null,null,null,null,{"$f":"IF(K11=\"\",\"\",_xlfn.XLOOKUP(K11,'Named Ranges'!$BC$4:$BC$6,'Named Ranges'!$BA$4:$BA$6,\"No\",-1,1))","v":""}]
[null,null,null,null,null,null,null,null,null,null,null,null,{"$f":"IF(K12=\"\",\"\",_xlfn.XLOOKUP(K12,'Named Ranges'!$BC$4:$BC$6,'Named Ranges'!$BA$4:$BA$6,\"No\",-1,1))","v":""}]
[null,null,null,null,null,null,null,null,null,null,null,null,{"$f":"IF(K13=\"\",\"\",_xlfn.XLOOKUP(K13,'Named Ranges'!$BC$4:$BC$6,'Named Ranges'!$BA$4:$BA$6,\"No\",-1,1))","v":""}]
[null,null,null,null,null,null,null,null,null,null,null,null,{"$f":"IF(K14=\"\",\"\",_xlfn.XLOOKUP(K14,'Named Ranges'!$BC$4:$BC$6,'Named Ranges'!$BA$4:$BA$6,\"No\",-1,1))","v":""}]
[null,null,null,null,null,null,null,null,null,null,null,null,{"$f":"IF(K15=\"\",\"\",_xlfn.XLOOKUP(K15,'Named Ranges'!$BC$4:$BC$6,'Named Ranges'!$BA$4:$BA$6,\"No\",-1,1))","v":""}]
{"$rows_left_out":459}
{"sheet":"C. Invoice Details","index":2,"n_rows":3,"n_cols":4,"rows_kept":3,"cut":false,"hidden":false,"merged":[[0,0,0,3]]}
["BAS Probity Data Request - Invoicing Details"]
["Mandatory","Non-Mandatory","Mandatory","Non-Mandatory\nUse to provide any additional info/ clarifications"]
["Supplier Project Code","Invoice Number","Total (excl. GST)","Comments"]

{"sheet":"D. Breakdown Details","index":3,"n_rows":487,"n_cols":15,"rows_kept":487,"cut":false,"hidden":false,"merged":[[0,0,0,14]]}
["BAS Probity Data Request - Breakdown Details"]
["Mandatory","Mandatory\nuse DropDown","Non-Mandatory","Mandatory\nuse DropDown","Non-Mandatory, Report only for Invoice Type \"Resources\"","Non-Mandatory, Report only for Invoice Type \"Resources\"","Mandatory for Invoice Type \"Resources\"\nUse DropDown","Mandatory for Invoice Type \"Resources\"","Mandatory for Invoice Type \"Resources\"","Mandatory for Invoice Type \"Resources\"\nUse DropDown","Mandatory for Invoice Type \"Expenses\"","Mandatory for Invoice Type \"Expenses\"","Mandatory for Invoice Type \"Expenses\"","Auto Calculated","Non-Mandatory\nUse to provide any additional info/ clarifications"]
["Supplier Project Code","Invoice Type","Invoice Number","Billable or Non Billable","Resource Name\n(First Name)","Resource Name\n(Last Name)","Resource Role\n(NSW Government Equivalent)","Daily Rate - based std on 8 Hrs\n($, excl. GST)","Number of days (8hrs) invoiced","Above Capped Rate Approval (Y/N)","Disbursement Billing Methodology","Expense Type","Expense Amount","Total invoiced\n($, excl. GST)","Comments"]
[null,null,null,null,null,null,null,null,null,null,null,null,null,{"$f":"IF(D4=\"Non Billable\",0,(IF(B4=\"Resources\",I4*H4,M4)))","v":0}]
[null,null,null,null,null,null,null,null,null,null,null,null,null,{"$f":"IF(D5=\"Non Billable\",0,(IF(B5=\"Resources\",I5*H5,M5)))","v":0}]
[null,null,null,null,null,null,null,null,null,null,null,null,null,0]
[null,null,null,null,null,null,null,null,null,null,null,null,null,0]
[null,null,null,null,null,null,null,null,null,null,null,null,null,0]
[null,null,null,null,null,null,null,null,null,null,null,null,null,0]
[null,null,null,null,null,null,null,null,null,null,null,null,null,0]
[null,null,null,null,null,null,null,null,null,null,null,null,null,0]
[null,null,null,null,null,null,null,null,null,null,null,null,null,0]
[null,null,null,null,null,null,null,null,null,null,null,null,null,0]
[null,null,null,null,null,null,null,null,null,null,null,null,null,0]
[null,null,null,null,null,null,null,null,null,null,null,null,null,0]
{"$rows_left_out":473}
{"sheet":"Reference","index":4,"n_rows":85,"n_cols":11,"rows_kept":85,"cut":false,"hidden":false,"merged":[[2,4,2,6],[13,4,13,6],[0,0,0,10],[2,8,2,10]]}
["BAS Probity Data Request - Descriptions"]
[]
["Table 1 - Agency View By Cluster",null,"Table 2 - Service Type By Consulting Engagement Type",null,"Table 3 - Roles Definitions ",null,null,null,"Table 5 - Engagement Tab Commenting"]
[]
["SELECT CLUSTER BELOW TO VIEW",null,"SELECT ENGAGMENT TYPE BELOW TO VIEW",null,"NSW Government Role","Description","Years of Experience",null,"Situation","Comment Structure","Example"]
["Treasury",null,null,null,"Partner","Senior Management member","12+",null,"When a previously reported invoice is reversed, or a credit note is made.","Invoice Reverse/Credit Note: Invoice # | Invoice Amount. | Invoice Billing Month | Resource or Expense","Invoice Reverse/Credit Note: 757829734 | $12,000 | Jan 2019 | Resource"]
[{"$f":"IFERROR(INDEX(INDIRECT(SUBSTITUTE(SUBSTITUTE($A$6,\" \",\"_\"),\",\",\"\")),ROW()-6),\"\")","v":"Crown Finance Entity"},null,{"$f":"IFERROR(INDEX(INDIRECT(SUBSTITUTE(SUBSTITUTE($C$6,\" \",\"_\"),\",\",\"\")),ROW()-6),\"\")","v":""},null,"Director","Management  member with deep expertise","10+",null,"A change in total engagement cost.","Updated Total Engagement Cost: Previous Cost | New Cost | Reason (Optional)","Updated Total Engagement Cost: $50,000 | $50,500 | Extended due to travel costs"]
["First State Superannuation Trustee Corporation",null,{"$f":"IFERROR(INDEX(INDIRECT(SUBSTITUTE(SUBSTITUTE($C$6,\" \",\"_\"),\",\",\"\")),ROW()-6),\"\")","v":""},null,"Senior Manager","Senior employee with significant specialist expertise and team leadership capabilities","8+",null,"A change in start date.","Change in Start Date: Previous Start date | New Start date | Reason (Optional)","Change in Start Date: 01/01/2019 | 01/02/2019 | Delay in project"]
["Fund for Jobs for NSW",null,"",null,"Manager","Junior level of entity management, specialist technical and subject matter expertise; manages assignment schedules and resource allocation"," 6 - 8",null,"A change in end date.","Change in End Date: Previous End date | New End date | Reason (Optional)","Change in End Date: 01/01/2019 | 01/02/2019 | Extended due to project scope."]
["Insurance and Care NSW (icare)",null,"",null,"Senior Consultant","Field leadership role, moderate level of technical and subject matter expertise; provides business system advice and consulting services"," 4 - 6",null,"A change in project code.","Change in Project Code: Old code | New Code | Reason (Optional)","Change in Project Code: NSWP1234 | NSWP3214 | Sub-engagement joined to large one."]
["Lifetime Care and Support Authority of NSW",null,"",null,"Consultant","Performs detailed data and systems analysis, identifies risks, gathers additional data, interprets data and provides recommendations for improvement.  Higher level technical skills, broader experience base, business process & industry knowledge and requiring less supervision than an analyst"," < 4",null,"A change in project scope.","Change in Project Scope: Old scope | New scope | Description of resources impacted (If applicable)","Change in Project Scope: Fixed Price | Time & Material – Capped | Incorrect original reporting"]
["NSW Procurement",null,"",null,"Analyst","Performs data gathering and analysis with strong technical skills. Low level of industry knowledge.  Supervised by more senior members.","0-4",null,"Addition comments that lie outside of the structures above that would assist in amending/interpreting reported data.","Extra Commentary: Please keep concise"]
["NSW Treasury",null,""]
["Office of Small Business Commissioner",null,null,null,"Table 4 - Consulting Services Defintions"]
["SAS Trustee Corporation"]
{"$rows_left_out":71}
{"sheet":"Agency Structure","index":5,"n_rows":284,"n_cols":3,"rows_kept":284,"cut":false,"hidden":false,"merged":[[211,1,220,1],[221,1,255,1],[256,1,271,1],[272,1,283,1],[52,1,72,1],[0,1,0,2],[39,1,51,1],[3,1,38,1],[186,1,210,1],[73,1,113,1],[114,1,185,1]]}
[null,"BAS Cluster and Agency Hierarchy"]
[]
[null,"Cluster","Agency  "]
[null,"Customer Service","Behavioural Insights Unit"]
[null,null,"Better Regulation Division"]
[null,null,"Board of Surveying and Spatial Information"]
[null,null,"Building Professionals Board"]
[null,null,"Corporate Services"]
[null,null,"Customer, Delivery and Transformation"]
[null,null,"Data Analytics Centre"]
[null,null,"Department of Customer Service"]
[null,null,"Fair Trading Administration Corporation"]
[null,null,"Home Building Compensation Fund"]
[null,null,"ICT & Digital Government"]
[null,null,"Independent Pricing And Regulatory Tribunal of NSW"]
{"$rows_left_out":270}
{"sheet":"Sheet1","index":6,"n_rows":412,"n_cols":2,"rows_kept":412,"cut":false,"hidden":true,"merged":[]}
["Agency","Cluster"]
["NSW MINISTRY OF HEALTH","Health"]
["Create NSW","Premier and Cabinet"]
["Heritage NSW","Planning, Industry and Environment,Premier and Cabinet"]
["Fisheries","Regional NSW"]
["Aboriginal Housing Office","Planning, Industry and Environment,Stronger Communities"]
["Department of Communities and Justice","Stronger Communities"]
["Aboriginal Affairs","Premier and Cabinet"]
["Multicultural NSW","Stronger Communities"]
["Department of Regional NSW","Regional NSW"]
["NSW Department of Primary Industries","Regional NSW"]
["Department of Primary Industries ","Regional NSW"]
["Primary Industries","Regional NSW"]
["National Parks and Wildlife Service","Planning, Industry and Environment"]
["Department of Planning and Environment","Regional NSW"]
{"$rows_left_out":398}
{"sheet":"Named Ranges","index":7,"n_rows":74,"n_cols":59,"rows_kept":74,"cut":false,"hidden":true,"merged":[]}
[null,"Tab C. Engagements",null,"Tab C. Engagements",null,"Tab C. Engagements",null,"Tab C. Engagements",null,null,null,null,null,null,null,null,null,null,null,null,null,null,null,"Tab C. Engagements",null,null,null,null,null,null,null,null,null,null,null,"Tab C. Engagements",null,null,"Tab D., E. Resources",null,"Tab D., E. Resources",null,"Tab F. Expenses",null,"Tab F. Expenses",null,"Tab F. Expenses",null,"Tab C / D. Resources"]
[null,null,null,null,null,null,null,"Taxonomy 2017",{"$f":"COUNTA(I4:I88)","v":1},3,1,1,7,8,6,3,4,1,2,1,1,7,null,"As per new list of Agencies April 2022",{"$f":"COUNTA(Y$4:Y$89)","v":13},35,36,41,{"$f":"COUNTA(AC$4:AC$88)","v":71},25,{"$f":"COUNTA(AE$4:AE$89)","v":16},{"$f":"COUNTA(AF$4:AF$89)","v":12},{"$f":"COUNTA(AG$4:AG$89)","v":21},{"$f":"COUNTA(AH$4:AH$89)","v":10}]
[null,"The engagement was won trhough competitive bidding?",null,"Assignment / Secondement",null,"Pricing Model",null,"Engagement Type","Actuarial Services","Audit, Quality Assurance and Risk","Business Processes","Change Management","Financial Services","Government and Business Strategy","Human Resources","Marketing and Customer","Procurement and Supply Chain","Project Management","Taxation","Telecommunications","Transaction Services","ICT Consulting",null,"Cluster","Education","Stronger Communities","Customer Service","Health","Planning and Environment","Premier and Cabinet","Transport and Infrastructure","Treasury","Enterprise, Investment and Trade","Regional NSW",null,"Status",null,null,"Billable hours VS Non Billable hours",null,"Resource Billing Methodology",null,"Disbursement Billing Methodology",null,"Billable VS Non Billable",null,"Expense Type",null,"Resource Role",null,"Invoice Type",null,"FrameWork",null,"Framework key dates",null,"Above Capped Rate Approval (Y/N)",null,"New Engagement (or) Update to Engagement details ?"]
[null,"YES",null,"Assignment",null,"Fixed Price",null,"Actuarial Services","Actuarial Services","Internal/External Audit","Business Process Mapping/Re-engineering","Change Management","Accounting Services","Business Intelligence","Culture","Customer/Customer Experience","Category Management","Project Management","Goods and Services Tax (GST)","Telecommunications Consultancy","Transaction Services","ICT Strategy, Planning and Design",null,"Customer Service","Adult Migrant English Service(AMES)","Advocate for Children and Young People","Behavioural Insights Unit","Agency for Clinical Innovation","Aboriginal Housing Office","Aboriginal Affairs","Centennial Park and Moore Park Trust","Crown Finance Entity","Art Gallery of NSW Trust","Corporate - Regional NSW",null,"Open",null,null,"Billable",null,"Daily Rate",null,"Per Actuals",null,"Billable",null,"Accommodation",null,"Partner",null,"Resource",null,"2018+",null,"2018-01-01",null,"Y",null,"New Engagement"]
[null,"NO",null,"Secondment",null,"Time & Material - Capped",null,"Audit, Quality Assurance and Risk",null,"Probity Services",null,null,"Accounting Standards","Business Performance Reviews","Diversity","Market Research","Procurement/Sourcing",null,"Other Tax Services",null,null,"ICT Risk Management, Compliance and Security",null,"Education","Department of Education and Communities","Anzac Memorial Building Trust","Better Regulation Division","Ambulance Service of NSW","Agricultural Scientific Collections Trust","Arts & Culture","Department of Transport","First State Superannuation Trustee Corporation","Australian Museum Trust","Department of Primary Industries",null,"Closed",null,null,"Non Billable",null,"Hourly Rate",null,"Fixed % of project value",null,"Non Billable",null,"Airfares",null,"Director",null,"Expense",null,"2020+",null,"2020-01-05",null,"N",null,"Update to an already reported engagement"]
[null,null,null,null,null,"Time & Material - Uncapped",null,"Business Processes",null,"Risk Management",null,null,"Asset Management","Cost Management","Human Capital Management","Pricing","Procurement Accreditation",null,null,null,null,"ICT Policy",null,"Enterprise, Investment and Trade","Early Childhood Education and Care","Civil and Administrative Tribunal of New South Wales","Board of Surveying and Spatial Information","Bureau of Health Information","Aquaculture Trust Fund","Arts NSW","Greater Sydney Commission","Fund for Jobs for NSW","Create NSW","Department of Regional NSW",null,"On Hold",null,null,null,null,null,null,"Capped at % of the project value reconciled to actuals",null,null,null,"Car Hire",null,"Senior Manager",null,null,null,"2022+",null,"2022-04-01"]
[null,null,null,null,null,"Risk/Reward (Outcome Based Arrangement)",null,"Change Management",null,null,null,null,"Finance Process Reviews","Governance","Remuneration",null,"Supply Chain",null,null,null,null,"ICT Audits",null,"Health","NSW Education Standards Authority","Cluster Reform","Building Professionals Board","Cancer Institute NSW","Belgenny Farm Trust","Audit Office of NSW","Independent Transport Safety Regulator","Insurance and Care NSW (icare)","Destination NSW","Forestry Corporation of NSW",null,null,null,null,null,null,null,null,"No disbursements",null,null,null,"Couriers",null,"Manager",null,null,null,"No"]
[null,null,null,null,null,null,null,"Financial Services",null,null,null,null,"Financial/Economic Advisory Services","Organisational Design/Transformation","Retention",null,null,null,null,null,null,"ICT Change Management",null,"Planning and Environment","NSW Skills Board","Community Services","Corporate Services","Central Coast Local Health District","Biodiversity Conservation Trust","Barangaroo Delivery Authority","Infrastructure NSW","Lifetime Care and Support Authority of NSW","Institute of Sport","Local Land Services",null,null,null,null,null,null,null,null,null,null,null,null,"Database and Market Research",null,"Senior Consultant"]
[null,null,null,null,null,null,null,"Government and Business Strategy",null,null,null,null,"Forensic advisory","Strategic Business Case","Work Health and Safety (WHS)",null,null,null,null,null,null,"ICT Project Management",null,"Premier and Cabinet","NSW Veterinary Practitioners Board","Corporate Services","Customer, Delivery and Transformation","Clinical Excellence Commission","Boards & Committees","Cross Border Commissioner","NSW Trains","NSW Procurement","Investment NSW","NSW Farmers Association",null,null,null,null,null,null,null,null,null,null,null,null,"Disbursements Cap",null,"Consultant"]
[null,null,null,null,null,null,null,"Human Resources",null,null,null,null,"Valuations","Strategy Development and Planning",null,null,null,null,null,null,null,"ICT Training and Development",null,"Regional NSW","NSW Vocational Education & Accreditation Board (VETAB)","Corrective Services NSW","Data Analytics Centre","eHealth","Cemeteries and Crematoria NSW","Culture Policy Branch","Office of Transport Safety Investigations","NSW Treasury","Jobs Investment and Tourism","Primary Industries Ministerial Advisory Council",null,null,null,null,null,null,null,null,null,null,null,null,"Meals - Breakfast",null,"Analyst"]
[null,null,null,null,null,null,null,"Marketing and Customer",null,null,null,null,null,"Policy Review and Development",null,null,null,null,null,null,null,null,null,"Stronger Communities","Office of Education","Courts & Tribunal Services","Department of Customer Service","Far West Local Health District","Charter Fishing Trust Fund","Department of Premier & Cabinet","Place Management","Office of Small Business Commissioner","Library Council","Public Works Advisory",null,null,null,null,null,null,null,null,null,null,null,null,"Meals - Dinner"]
[null,null,null,null,null,null,null,"Procurement and Supply Chain",null,null,null,null,null,null,null,null,null,null,null,null,null,null,null,"Transport and Infrastructure","Public Schools","Crown Solicitor's Office","Fair Trading Administration Corporation","Health Administration Corporation","Chipping Norton Lake Authority","Independent Commission Against Corruption","Roads and Maritime Services","SAS Trustee Corporation","Liquor Gaming & Racing","Regional Growth NSW Development Corporation",null,null,null,null,null,null,null,null,null,null,null,null,"Meals - Lunch"]
[null,null,null,null,null,null,null,"Project Management",null,null,null,null,null,null,null,null,null,null,null,null,null,null,null,"Treasury","State Training Services","FACS Business Services","Home Building Compensation Fund","Health Education and Training Institute","Coal Innovation Fund","Inspector of the Independent Commission Against Corruption (ICAC)","Royal Botanic Gardens and Domain Trust","Skills & Economic Development including Jobs for NSW","NSW Chief Scientist and Engineer","Rural Assistance Authority",null,null,null,null,null,null,null,null,null,null,null,null,"Other Travel"]
[null,null,null,null,null,null,null,"Taxation",null,null,null,null,null,null,null,null,null,null,null,null,null,null,null,null,"TAFE","Fire and Rescue NSW","ICT & Digital Government","Health Infrastructure","Cobar Water Board","Inspector of the Law Enforcement Conduct Commission","State Transit Authority","Treasury Corporation (TCorp)","Office of the Chief Executive - Oos",null,null,null,null,null,null,null,null,null,null,null,null,null,"Photocopying"]
[null,null,null,null,null,null,null,"Telecommunications",null,null,null,null,null,null,null,null,null,null,null,null,null,null,null,null,"TAFE Commission","Housing NSW","Independent Pricing And Regulatory Tribunal of NSW","Health Professional Councils Authority","Commercial Fishing Trust Fund","Law Enforcement Conduct Commission","Sydney Metro","Western City and Aerotropolis Authority","Office of the Greyhound Welfare and Integrity Commission",null,null,null,null,null,null,null,null,null,null,null,null,null,"Room Hire & catering"]
{"$rows_left_out":59}